Target
Nuclear factor erythroid 2-related factor 2
Ligand
BDBM50212083
Substrate
Meas. Tech.
ChEMBL_1636712 (CHEMBL3879610)
EC50
3200±n/a nM
Citation
 Deck, LMWhalen, LJHunsaker, LARoyer, REVander Jagt, DL Activation of anti-oxidant Nrf2 signaling by substituted trans stilbenes. Bioorg Med Chem 25:1423-1430 (2017)  
Target
Name:
Nuclear factor erythroid 2-related factor 2
Synonyms:
HEBP1 NF-E2-related factor 2 NFE2-related factor 2 NRF2 Nuclear factor, erythroid derived 2, like 2
Type:
PROTEIN
Mol. Mass.:
67786.89
Organism:
Homo sapiens (Human)
Description:
ChEMBL_107924
Residue:
605
  
Inhibitor
Name:
BDBM50212083
Synonyms:
CHEMBL3943390
Type:
Small organic molecule
Emp. Form.:
C15H12F2O
Mol. Mass.:
246.252
SMILES:
COc1ccc(\C=C\c2cc(F)ccc2F)cc1
: