Target
Acyl-protein thioesterase 2
Ligand
BDBM50212216
Substrate
Meas. Tech.
ChEMBL_1636779 (CHEMBL3879677)
IC50
>10000±n/a nM
Citation
 Won, SJEschweiler, JDMajmudar, JDChong, FSHwang, SYRuotolo, BTMartin, BR Affinity-Based Selectivity Profiling of an In-Class Selective Competitive Inhibitor of Acyl Protein Thioesterase 2. ACS Med Chem Lett 8:215-220 (2017)  
Target
Name:
Acyl-protein thioesterase 2
Synonyms:
APT2 LYPA2_HUMAN Lysophospholipase II
Type:
Protein
Mol. Mass.:
24740.23
Organism:
Homo sapiens (Human)
Description:
O95372
Residue:
231
  
Inhibitor
Name:
BDBM50212216
Synonyms:
CHEMBL3944678
Type:
Small organic molecule
Emp. Form.:
C43H54N8O9S3
Mol. Mass.:
923.132
SMILES:
[H][C@]12CS[C@@H](CCCCC(=O)NCCOCCOCCOCCn3cc(COc4ccc(cc4)N4CCN(CC4)C(=O)c4cc5CS(=O)(=O)c6ccccc6-c5s4)nn3)[C@@]1([H])NC(=O)N2
: