Target
72 kDa type IV collagenase
Ligand
BDBM50212249
Substrate
Meas. Tech.
ChEMBL_1636836 (CHEMBL3879734)
IC50
0.160000±n/a nM
Citation
 Nuti, ERosalia, LCuffaro, DCamodeca, CGiacomelli, CDa Pozzo, ETuccinardi, TCosta, BAntoni, CVera, LCiccone, LOrlandini, ENencetti, SDive, VMartini, CStura, EARossello, A Bifunctional Inhibitors as a New Tool To Reduce Cancer Cell Invasion by Impairing MMP-9 Homodimerization. ACS Med Chem Lett 8:293-298 (2017)  
Target
Name:
72 kDa type IV collagenase
Synonyms:
72 kDa gelatinase CLG4A Gelatinase A (MMP-2) MMP2_HUMAN Matrix metalloproteinase-2 (MMP 2) Matrix metalloproteinases 2 (MMP-2) | TBE-1
Type:
Enzyme
Mol. Mass.:
73870.36
Organism:
Homo sapiens (Human)
Description:
P08253
Residue:
660
  
Inhibitor
Name:
BDBM50212249
Synonyms:
CHEMBL3900422
Type:
Small organic molecule
Emp. Form.:
C26H29N3O5S
Mol. Mass.:
495.591
SMILES:
CC(C)[C@@H](N(CCNC(=O)c1ccccc1)S(=O)(=O)c1ccc(cc1)-c1ccccc1)C(=O)NO
: