Target
Mitogen-activated protein kinase kinase kinase 5
Ligand
BDBM50212280
Substrate
Meas. Tech.
ChEMBL_1636848 (CHEMBL3879746)
IC50
10.0±n/a nM
Citation
 Lanier, MPickens, JBigi, SVBradshaw-Pierce, ELChambers, ACheruvallath, ZSCole, DDougan, DRErmolieff, JGibson, THalkowycz, PHirokawa, AIvetac, AMiura, JNunez, ESabat, MTyhonas, JWang, HWang, XSwann, S Structure-Based Design of ASK1 Inhibitors as Potential Agents for Heart Failure. ACS Med Chem Lett 8:316-320 (2017)  
Target
Name:
Mitogen-activated protein kinase kinase kinase 5
Synonyms:
ASK1 MAP3K5 MEKK5
Type:
Protein
Mol. Mass.:
154514.93
Organism:
Homo sapiens (Human)
Description:
Q99683
Residue:
1374
  
Inhibitor
Name:
BDBM50212280
Synonyms:
CHEMBL3962015
Type:
Small organic molecule
Emp. Form.:
C18H17N5O2
Mol. Mass.:
335.3599
SMILES:
C[C@H](CO)n1cnnc1-c1cccc(n1)N1Cc2ccccc2C1=O
: