Target
5-hydroxytryptamine receptor 1B
Ligand
BDBM50036868
Substrate
Meas. Tech.
ChEMBL_1826 (CHEMBL616798)
IC50
1000±n/a nM
Citation
  Fluorescent probes for 5-HT1A receptors: Synthesis and characterization of 5-methoxy-3-[n-propyl(4-n-aminobutyl)] amino-3,4-dihydro-2H-1-benzopyran derivatives Bioorg Med Chem Lett 3:1935-1940 (1993)   
Target
Name:
5-hydroxytryptamine receptor 1B
Synonyms:
5-HT-1B 5-HT1B 5HT1B_HUMAN HTR1DB Serotonin (5-HT) receptor Serotonin Receptor 1B
Type:
G Protein-Coupled Receptor (GPCR)
Mol. Mass.:
43579.17
Organism:
Homo sapiens (Human)
Description:
Receptor binding assays were performed using human clone stably expressed in CHO cells
Residue:
390
  
Inhibitor
Name:
BDBM50036868
Synonyms:
2-{4-[(5-Methoxy-chroman-3-yl)-propyl-amino]-butyl}-1,1-dioxo-1,2-dihydro-1lambda*6*-benzo[d]isothiazol-3-one; compound with oxalic acid | CHEMBL51561
Type:
Small organic molecule
Emp. Form.:
C24H30N2O5S
Mol. Mass.:
458.57
SMILES:
CCCN(CCCCN1C(=O)c2ccccc2S1(=O)=O)C1COc2cccc(OC)c2C1
: