Target
Beta-lactamase SHV-1
Ligand
BDBM50212638
Substrate
Meas. Tech.
ChEMBL_40707 (CHEMBL654919)
IC50
72.0±n/a nM
Citation
  TBA Bioorg Med Chem Lett 3:2247-2252 (1993)   
Target
Name:
Beta-lactamase SHV-1
Synonyms:
BLA1_KLEPN SHV-1 beta-lactamase shv1
Type:
Protein
Mol. Mass.:
31226.68
Organism:
Klebsiella pneumoniae (Enterobacteria)
Description:
4R3B
Residue:
286
  
Inhibitor
Name:
BDBM50212638
Synonyms:
CHEMBL302512
Type:
Small organic molecule
Emp. Form.:
C10H13N5O5S2
Mol. Mass.:
347.371
SMILES:
[H][C@@]12CC(=O)N1[C@@H](C(O)=O)[C@](C)(CSc1nnnn1C)S2(=O)=O
: