Target
Beta-lactamase
Ligand
BDBM50212637
Substrate
Meas. Tech.
ChEMBL_41054 (CHEMBL648218)
IC50
570±n/a nM
Citation
  TBA Bioorg Med Chem Lett 3:2247-2252 (1993)   
Target
Name:
Beta-lactamase
Synonyms:
BLAC_STAAU Penicillinase | blaZ
Type:
PROTEIN
Mol. Mass.:
31367.53
Organism:
Staphylococcus aureus
Description:
ChEMBL_41052
Residue:
281
  
Inhibitor
Name:
BDBM50212637
Synonyms:
CHEMBL72046
Type:
Small organic molecule
Emp. Form.:
C11H14N2O5S3
Mol. Mass.:
350.434
SMILES:
[H][C@@]12CC(=O)N1[C@@H](C(O)=O)[C@](C)(CSC1=NCCS1)S2(=O)=O
: