Target
Type-1 angiotensin II receptor A/Type-1 angiotensin II receptor B/Type-2 angiotensin II receptor
Ligand
BDBM82258
Substrate
Meas. Tech.
ChEMBL_36470 (CHEMBL653123)
IC50
13±n/a nM
Citation
  TBA Bioorg Med Chem Lett 3:757-760 (1993)   
Target
Name:
Type-1 angiotensin II receptor A/Type-1 angiotensin II receptor B/Type-2 angiotensin II receptor
Synonyms:
Angiotensin II receptor | Type-1A/Type-1B/Type-2 angiotensin II receptor
Type:
Mol. Mass.:
Description:
ASSAY_ID of ChEMBL is 36477
Components:
This complex has 3 components.
Component 1
Name:
Type-1 angiotensin II receptor B
Synonyms:
AGTRB_RAT Agtr1 Angiotensin II AT1B Angiotensin II type 1b (AT-1b) receptor Type-1B angiotensin II receptor
Type:
Enzyme Catalytic Domain
Mol. Mass.:
40929.44
Organism:
RAT
Description:
Angiotensin II AT1B 0 RAT::P29089
Residue:
359
  
Component 2
Name:
Type-2 angiotensin II receptor
Synonyms:
AGTR2_RAT Agtr2 Angiotensin II receptor Type-2 angiotensin II receptor
Type:
Enzyme Catalytic Domain
Mol. Mass.:
41346.62
Organism:
RAT
Description:
Angiotensin II AT2 0 0::P35351
Residue:
363
  
Component 3
Name:
Type-1 angiotensin II receptor A
Synonyms:
AGTRA_RAT Agtr1 Angiotensin II AT1 Angiotensin II receptor (AT-1) type-1 Type-1A angiotensin II receptor
Type:
Enzyme Catalytic Domain
Mol. Mass.:
40910.53
Organism:
RAT
Description:
ANGIOTENSIN AT1 AGTR1 RAT::P25095
Residue:
359
  
Inhibitor
Name:
BDBM82258
Synonyms:
CAS_114798-26-4 NSC_3961
Type:
Small organic molecule
Emp. Form.:
C22H23ClN6O
Mol. Mass.:
422.911
SMILES:
CCCCc1nc(Cl)c(CO)n1Cc1ccc(cc1)-c1ccccc1-c1nnn[nH]1
: