Target
Melatonin receptor type 1C
Ligand
BDBM50212917
Substrate
Meas. Tech.
ChEMBL_104753 (CHEMBL712436)
Ki
14±n/a nM
Citation
  TBA Bioorg Med Chem Lett 4:1555-1558 (1994)   
Target
Name:
Melatonin receptor type 1C
Synonyms:
CKB Mel-1C-R Melatonin receptor type 1C
Type:
PROTEIN
Mol. Mass.:
38595.98
Organism:
Gallus gallus
Description:
ChEMBL_104739
Residue:
346
  
Inhibitor
Name:
BDBM50212917
Synonyms:
CHEMBL43083
Type:
Small organic molecule
Emp. Form.:
C12H12Br2N2O
Mol. Mass.:
360.044
SMILES:
BrCC(=O)NCCc1c(Br)[nH]c2ccccc12
: