Target
Melatonin receptor type 1C
Ligand
BDBM50212923
Substrate
Meas. Tech.
ChEMBL_104756 (CHEMBL712439)
Ki
5350±n/a nM
Citation
  TBA Bioorg Med Chem Lett 4:1559-1564 (1994)   
Target
Name:
Melatonin receptor type 1C
Synonyms:
CKB Mel-1C-R Melatonin receptor type 1C
Type:
PROTEIN
Mol. Mass.:
38595.98
Organism:
Gallus gallus
Description:
ChEMBL_104739
Residue:
346
  
Inhibitor
Name:
BDBM50212923
Synonyms:
CHEMBL41973
Type:
Small organic molecule
Emp. Form.:
C14H16N2O
Mol. Mass.:
228.2896
SMILES:
CC(=O)NC1CCc2[nH]c3ccccc3c2C1
: