Target
5-hydroxytryptamine receptor 4
Ligand
BDBM85027
Substrate
Meas. Tech.
ChEBML_3296
Ki
0.100000±n/a nM
Citation
  TBA Bioorg Med Chem Lett 5:2119-2122 (1995)   
Target
Name:
5-hydroxytryptamine receptor 4
Synonyms:
5-HT4 5HT4R_CAVPO Serotonin 4 (5-HT4) receptor
Type:
Enzyme Catalytic Domain
Mol. Mass.:
43735.29
Organism:
GUINEA PIG
Description:
5-HT4 HTR4 GUINEA PIG::O70528
Residue:
388
  
Inhibitor
Name:
BDBM85027
Synonyms:
1-(7-Chloro-8-amino-1,4-benzodioxane-5-yl)-3-[1-[3-(3,4-dimethoxyphenyl)propyl]piperidine-4-yl]propane-1-one | RS 100235
Type:
Small organic molecule
Emp. Form.:
C27H35ClN2O5
Mol. Mass.:
503.03
SMILES:
COc1ccc(CCCN2CCC(CCC(=O)c3cc(Cl)c(N)c4OCCOc34)CC2)cc1OC
: