Target
Adenosine receptor A2b
Ligand
BDBM55121
Substrate
Meas. Tech.
ChEMBL_32937 (CHEMBL646079)
Ki
977±n/a nM
Citation
  TBA Bioorg Med Chem Lett 5:2371-2376 (1995)   
Target
Name:
Adenosine receptor A2b
Synonyms:
AA2BR_RAT Adora2b
Type:
PROTEIN
Mol. Mass.:
36378.84
Organism:
Rattus norvegicus
Description:
ChEMBL_32934
Residue:
332
  
Inhibitor
Name:
BDBM55121
Synonyms:
3-HYDROXYTYRAMINE HYDROCHLORIDE 4-(2-aminoethyl)pyrocatechol;hydrochloride Dopamine SMR000059081 | cid_65340
Type:
Small organic molecule
Emp. Form.:
C8H11NO2
Mol. Mass.:
153.1784
SMILES:
NCCc1ccc(O)c(O)c1
: