Target
Adenosine receptor A2b
Ligand
BDBM50019396
Substrate
Meas. Tech.
ChEMBL_32937 (CHEMBL646079)
Ki
<10000±n/a nM
Citation
  TBA Bioorg Med Chem Lett 5:2371-2376 (1995)   
Target
Name:
Adenosine receptor A2b
Synonyms:
AA2BR_RAT Adora2b
Type:
PROTEIN
Mol. Mass.:
36378.84
Organism:
Rattus norvegicus
Description:
ChEMBL_32934
Residue:
332
  
Inhibitor
Name:
BDBM50019396
Synonyms:
4-(2-Dipropylamino-ethyl)-benzene-1,2-diol CHEMBL15564 | N,N-di-n-Propyldopamine
Type:
Small organic molecule
Emp. Form.:
C14H23NO2
Mol. Mass.:
237.3379
SMILES:
CCCN(CCC)CCc1ccc(O)c(O)c1
: