Target
Type-1 angiotensin II receptor A/B
Ligand
BDBM50213782
Substrate
Meas. Tech.
ChEMBL_36647 (CHEMBL652357)
IC50
0.080000±n/a nM
Citation
  TBA Bioorg Med Chem Lett 5:2617-2622 (1995)   
Target
Name:
Type-1 angiotensin II receptor A/B
Synonyms:
Angiotensin II receptor (AT-1) type-1 | Type-1A/Type-1B angiotensin II receptor
Type:
Mol. Mass.:
Description:
ASSAY_ID of ChEMBL is 901964
Components:
This complex has 2 components.
Component 1
Name:
Type-1 angiotensin II receptor B
Synonyms:
AGTRB_RAT Agtr1 Angiotensin II AT1B Angiotensin II type 1b (AT-1b) receptor Type-1B angiotensin II receptor
Type:
Enzyme Catalytic Domain
Mol. Mass.:
40929.44
Organism:
RAT
Description:
Angiotensin II AT1B 0 RAT::P29089
Residue:
359
  
Component 2
Name:
Type-1 angiotensin II receptor A
Synonyms:
AGTRA_RAT Agtr1 Angiotensin II AT1 Angiotensin II receptor (AT-1) type-1 Type-1A angiotensin II receptor
Type:
Enzyme Catalytic Domain
Mol. Mass.:
40910.53
Organism:
RAT
Description:
ANGIOTENSIN AT1 AGTR1 RAT::P25095
Residue:
359
  
Inhibitor
Name:
BDBM50213782
Synonyms:
CHEMBL264304
Type:
Small organic molecule
Emp. Form.:
C36H36N4O5S3
Mol. Mass.:
700.89
SMILES:
CCCc1nc(SC)c(C(=O)C[S+]([O-])c2ccccc2)n1Cc1ccc(cc1)-c1ccccc1S(=O)(=O)NC(=O)NCc1ccccc1
: