Target
DNA topoisomerase 2-alpha/2-beta
Ligand
BDBM50213810
Substrate
Meas. Tech.
ChEBML_208606
EC50
1200±n/a nM
Citation
  TBA Bioorg Med Chem Lett 5:1021-1026 (1995)   
Target
Name:
DNA topoisomerase 2-alpha/2-beta
Synonyms:
DNA topoisomerase II
Type:
Mol. Mass.:
Description:
ASSAY_ID of ChEMBL is 1821483
Components:
This complex has 2 components.
Component 1
Name:
DNA topoisomerase 2-alpha
Synonyms:
DNA topoisomerase 2-alpha DNA topoisomerase II (Topo II) DNA topoisomerase II, alpha isozyme TOP2A Topoisomerase I/II | Topoisomerase II alpha (HuTopoIIα)
Type:
Protein
Mol. Mass.:
174415.30
Organism:
Homo sapiens (Human)
Description:
P11388
Residue:
1531
  
Component 2
Name:
DNA topoisomerase 2-beta
Synonyms:
DNA topoisomerase II TOP2B | TOP2B_HUMAN
Type:
PROTEIN
Mol. Mass.:
183284.13
Organism:
Homo sapiens (Human)
Description:
ChEMBL_51583
Residue:
1626
  
Inhibitor
Name:
BDBM50213810
Synonyms:
CHEMBL7534
Type:
Small organic molecule
Emp. Form.:
C26H22F2N2O2
Mol. Mass.:
432.4619
SMILES:
Cc1cc(cc(C)n1)-c1c(F)cc2c(c1F)n(cc(Cc1ccc(O)cc1)c2=O)C1CC1
: