Target
D(2) dopamine receptor
Ligand
BDBM50007185
Substrate
Meas. Tech.
ChEBML_61648
Ki
20±n/a nM
Citation
  TBA Bioorg Med Chem Lett 6:1227-1232 (1996)   
Target
Name:
D(2) dopamine receptor
Synonyms:
D(2) dopamine receptor DOPAMINE D2 Long DRD2 Dopamine D2 receptor Dopamine D2 receptor (D2R) Dopamine2-like | d2
Type:
Cell-surface receptors
Mol. Mass.:
50647.10
Organism:
Homo sapiens (Human)
Description:
P14416
Residue:
443
  
Inhibitor
Name:
BDBM50007185
Synonyms:
CHEMBL21008 | N-{4-[4-(2-Methoxy-phenyl)-piperazin-1-yl]-butyl}-2,2-dimethyl-propionamide
Type:
Small organic molecule
Emp. Form.:
C20H33N3O2
Mol. Mass.:
347.4949
SMILES:
COc1ccccc1N1CCN(CCCCNC(=O)C(C)(C)C)CC1
: