Target
DNA topoisomerase 2-alpha/2-beta
Ligand
BDBM50213996
Substrate
Meas. Tech.
ChEMBL_208603 (CHEMBL812056)
EC50
550±n/a nM
Citation
  TBA Bioorg Med Chem Lett 6:1345-1350 (1996)   
Target
Name:
DNA topoisomerase 2-alpha/2-beta
Synonyms:
DNA topoisomerase II
Type:
Mol. Mass.:
Description:
ASSAY_ID of ChEMBL is 1821483
Components:
This complex has 2 components.
Component 1
Name:
DNA topoisomerase 2-alpha
Synonyms:
DNA topoisomerase 2-alpha DNA topoisomerase II (Topo II) DNA topoisomerase II, alpha isozyme TOP2A Topoisomerase I/II | Topoisomerase II alpha (HuTopoIIα)
Type:
Protein
Mol. Mass.:
174415.30
Organism:
Homo sapiens (Human)
Description:
P11388
Residue:
1531
  
Component 2
Name:
DNA topoisomerase 2-beta
Synonyms:
DNA topoisomerase II TOP2B | TOP2B_HUMAN
Type:
PROTEIN
Mol. Mass.:
183284.13
Organism:
Homo sapiens (Human)
Description:
ChEMBL_51583
Residue:
1626
  
Inhibitor
Name:
BDBM50213996
Synonyms:
CHEMBL30104
Type:
Small organic molecule
Emp. Form.:
C21H26N4O3S2
Mol. Mass.:
446.586
SMILES:
CCN(CC)CCn1nc2c3c1ccc(CNS(C)(=O)=O)c3sc1ccc(O)cc21
: