Target
5-hydroxytryptamine receptor 2C
Ligand
BDBM50214298
Substrate
Meas. Tech.
ChEMBL_2764 (CHEMBL617761)
Ki
0.199526±n/a nM
Citation
  TBA Bioorg Med Chem Lett 6:2687-2692 (1996)   
Target
Name:
5-hydroxytryptamine receptor 2C
Synonyms:
5-HT-2C 5-HT2C-INI 5-HTR2C 5-hydroxytryptamine receptor 2C (5-HT-2C) 5HT-1C HTR1C Serotonin (5-HT3) receptor Serotonin Receptor 2C
Type:
G Protein-Coupled Receptor (GPCR)
Mol. Mass.:
51836.79
Organism:
Homo sapiens (Human)
Description:
P28335
Residue:
458
  
Inhibitor
Name:
BDBM50214298
Synonyms:
CHEMBL93862
Type:
Small organic molecule
Emp. Form.:
C25H29N3O4
Mol. Mass.:
435.5155
SMILES:
COc1ccc(cc1C(=O)CCCCN1CCC2(CC1)NC(=O)NC2=O)-c1ccccc1
: