Target
Glutamate receptor ionotropic, NMDA 1
Ligand
BDBM50214332
Substrate
Meas. Tech.
ChEMBL_140328 (CHEMBL858425)
Ki
813±n/a nM
Citation
  TBA Bioorg Med Chem Lett 6:2749-2754 (1996)   
Target
Name:
Glutamate receptor ionotropic, NMDA 1
Synonyms:
Glutamate (NMDA) receptor subunit zeta 1 Glutamate-NMDA-Channel Glutamate-NMDA-Polyamine NMDA Nmdar1 | phencyclidine
Type:
Enzyme Catalytic Domain
Mol. Mass.:
105533.40
Organism:
RAT
Description:
P35439
Residue:
938
  
Inhibitor
Name:
BDBM50214332
Synonyms:
CHEMBL93062
Type:
Small organic molecule
Emp. Form.:
C9H8ClN3O2
Mol. Mass.:
225.632
SMILES:
Cc1nc2nc(O)c(O)nc2c(C)c1Cl
: