Target
Glutamate receptor ionotropic, NMDA 1
Ligand
BDBM50214345
Substrate
Meas. Tech.
ChEMBL_140328 (CHEMBL858425)
Ki
1514±n/a nM
Citation
  TBA Bioorg Med Chem Lett 6:2749-2754 (1996)   
Target
Name:
Glutamate receptor ionotropic, NMDA 1
Synonyms:
Glutamate (NMDA) receptor subunit zeta 1 Glutamate-NMDA-Channel Glutamate-NMDA-Polyamine NMDA Nmdar1 | phencyclidine
Type:
Enzyme Catalytic Domain
Mol. Mass.:
105533.40
Organism:
RAT
Description:
P35439
Residue:
938
  
Inhibitor
Name:
BDBM50214345
Synonyms:
CHEMBL96878
Type:
Small organic molecule
Emp. Form.:
C10H10ClN3O2
Mol. Mass.:
239.658
SMILES:
CCCc1nc2nc(O)c(O)nc2cc1Cl
: