Target
Estrogen receptor beta
Ligand
BDBM50214283
Substrate
Meas. Tech.
ChEMBL_66549 (CHEMBL677816)
IC50
5000±n/a nM
Citation
  TBA Bioorg Med Chem Lett 6:1047-1050 (1996)   
Target
Name:
Estrogen receptor beta
Synonyms:
Estrogen receptor
Type:
Mol. Mass.:
Description:
ASSAY_ID of ChEMBL is 66549
Components:
This complex has 2 components.
Component 1
Name:
Estrogen receptor
Synonyms:
ESR1_RAT Esr1 Nr3a1 | estrogen alpha
Type:
Enzyme Catalytic Domain
Mol. Mass.:
67045.89
Organism:
RAT
Description:
estrogen alpha 0 RAT::P06211
Residue:
600
  
Component 2
Name:
Estrogen receptor beta
Synonyms:
ESR2_RAT Esr2 Estrogen receptor beta | Nr3a2
Type:
PROTEIN
Mol. Mass.:
59173.80
Organism:
Rattus norvegicus
Description:
ChEMBL_803011
Residue:
530
  
Inhibitor
Name:
BDBM50214283
Synonyms:
CHEMBL266377
Type:
Small organic molecule
Emp. Form.:
C24H28N2O5
Mol. Mass.:
424.4895
SMILES:
CC[C@H]([C@H](CCCCn1cc(C(O)=O)c(=O)[nH]1)c1ccc(O)cc1)c1ccc(O)cc1
: