Target
Leukotriene B4 receptor 1/2
Ligand
BDBM50214753
Substrate
Meas. Tech.
ChEMBL_99483 (CHEMBL704371)
IC50
2700±n/a nM
Citation
  TBA Bioorg Med Chem Lett 7:2307-2312 (1997)   
Target
Name:
Leukotriene B4 receptor 1/2
Synonyms:
Leukotriene B4 receptor
Type:
Mol. Mass.:
Description:
ASSAY_ID of ChEMBL is 88360
Components:
This complex has 2 components.
Component 1
Name:
Leukotriene B4 receptor 2
Synonyms:
BLT2R LT4R2_HUMAN LTB4-R 2 LTB4R2 Leukotriene B4 Leukotriene B4 receptor Leukotriene B4 receptor BLT2 Seven transmembrane receptor BLTR2
Type:
Enzyme Catalytic Domain
Mol. Mass.:
37964.86
Organism:
Homo sapiens (Human)
Description:
Leukotriene 2 0 HUMAN::Q9NPC1
Residue:
358
  
Component 2
Name:
Leukotriene B4 receptor 1
Synonyms:
BLT BLTR Chemoattractant receptor-like 1 GPR16 LTB4-R 1 Leukotriene B4 R1 Leukotriene B4 receptor 1 P2Y purinoceptor 7 | P2Y7
Type:
Enzyme Catalytic Domain
Mol. Mass.:
37582.68
Organism:
Homo sapiens (Human)
Description:
Q15722
Residue:
352
  
Inhibitor
Name:
BDBM50214753
Synonyms:
CHEMBL78039
Type:
Small organic molecule
Emp. Form.:
C21H22O4
Mol. Mass.:
338.397
SMILES:
O[C@@H]1[C@@H](Cc2ccccc2)COc2cc(ccc12)C1(CCC1)C(O)=O
: