Target
D(3) dopamine receptor
Ligand
BDBM50215034
Substrate
Meas. Tech.
ChEMBL_62593 (CHEMBL673121)
Ki
10.0±n/a nM
Citation
  TBA Bioorg Med Chem Lett 7:485-488 (1997)   
Target
Name:
D(3) dopamine receptor
Synonyms:
DOPAMINE D3 DRD3_HUMAN Dopamine D3 receptor (D3) Dopamine receptor Dopamine receptor D3
Type:
Mol. Mass.:
44243.43
Organism:
Homo sapiens (Human)
Description:
Residue:
400
  
Inhibitor
Name:
BDBM50215034
Synonyms:
CHEMBL433552
Type:
Small organic molecule
Emp. Form.:
C30H32N2O4S
Mol. Mass.:
516.651
SMILES:
COc1ccc(cc1-c1ccc(CN2CCCCCC2c2ccccc2)[nH]1)S(=O)(=O)Oc1ccccc1
: