Target
Similar to alpha-tubulin isoform 1
Ligand
BDBM50215153
Substrate
Meas. Tech.
ChEMBL_211480 (CHEMBL819683)
IC50
3000±n/a nM
Citation
 Ohsumi, KHatanaka, TFujita, KNakagawa, RFukuda, YNihei, YSuga, YMorinaga, YAkiyama, YTsuji, T Syntheses and antitumor activity of cis-restricted combretastatins: 5-membered heterocyclic analogues. Bioorg Med Chem Lett 8:3153-8 (1998)  
Target
Name:
Similar to alpha-tubulin isoform 1
Synonyms:
Similar to alpha-tubulin isoform 1
Type:
PROTEIN
Mol. Mass.:
10383.05
Organism:
Bos taurus
Description:
ChEMBL_104716
Residue:
99
  
Inhibitor
Name:
BDBM50215153
Synonyms:
CHEMBL108621
Type:
Small organic molecule
Emp. Form.:
C19H21N3O4
Mol. Mass.:
355.3877
SMILES:
COc1ccc(cc1N)-c1c[nH]nc1-c1cc(OC)c(OC)c(OC)c1
: