Target
Phosphoglycerate kinase 1
Ligand
BDBM50216700
Substrate
Meas. Tech.
ChEMBL_371 (CHEMBL825022)
IC50
3600±n/a nM
Citation
 Caplan, NAPogson, CIHayes, DJBlackburn, GM Novel bisphosphonate inhibitors of phosphoglycerate kinase. Bioorg Med Chem Lett 8:515-20 (1998)  
Target
Name:
Phosphoglycerate kinase 1
Synonyms:
Cell migration-inducing gene 10 protein PGK1_HUMAN PGKA Phosphoglycerate kinase 1 | Primer recognition protein 2
Type:
PROTEIN
Mol. Mass.:
44619.74
Organism:
Homo sapiens (Human)
Description:
ChEMBL_104832
Residue:
417
  
Inhibitor
Name:
BDBM50216700
Synonyms:
CHEMBL149264
Type:
Small organic molecule
Emp. Form.:
C8H8Cl4O6P2
Mol. Mass.:
403.905
SMILES:
OP(O)(=O)C(Cl)(Cl)c1cccc(c1)C(Cl)(Cl)P(O)(O)=O
: