Target
Phosphoglycerate kinase 1
Ligand
BDBM50216711
Substrate
Meas. Tech.
ChEMBL_372 (CHEMBL615425)
pH
7.1±n/a
Ki
120000±n/a nM
Comments
extracted
Citation
 Caplan, NAPogson, CIHayes, DJBlackburn, GM Novel bisphosphonate inhibitors of phosphoglycerate kinase. Bioorg Med Chem Lett 8:515-20 (1998)  
Target
Name:
Phosphoglycerate kinase 1
Synonyms:
Cell migration-inducing gene 10 protein PGK1_HUMAN PGKA Phosphoglycerate kinase 1 | Primer recognition protein 2
Type:
PROTEIN
Mol. Mass.:
44619.74
Organism:
Homo sapiens (Human)
Description:
ChEMBL_104832
Residue:
417
  
Inhibitor
Name:
BDBM50216711
Synonyms:
CHEMBL147362
Type:
Small organic molecule
Emp. Form.:
C8H12O6P2
Mol. Mass.:
266.1248
SMILES:
OP(O)(=O)Cc1cccc(CP(O)(O)=O)c1
: