Target
Phosphoglycerate kinase 1
Ligand
BDBM50216699
Substrate
Meas. Tech.
ChEMBL_372 (CHEMBL615425)
pH
7.1±n/a
Ki
61000±n/a nM
Comments
extracted
Citation
 Caplan, NAPogson, CIHayes, DJBlackburn, GM Novel bisphosphonate inhibitors of phosphoglycerate kinase. Bioorg Med Chem Lett 8:515-20 (1998)  
Target
Name:
Phosphoglycerate kinase 1
Synonyms:
Cell migration-inducing gene 10 protein PGK1_HUMAN PGKA Phosphoglycerate kinase 1 | Primer recognition protein 2
Type:
PROTEIN
Mol. Mass.:
44619.74
Organism:
Homo sapiens (Human)
Description:
ChEMBL_104832
Residue:
417
  
Inhibitor
Name:
BDBM50216699
Synonyms:
CHEMBL147415
Type:
Small organic molecule
Emp. Form.:
C7H9F2NO6P2
Mol. Mass.:
303.0938
SMILES:
OP(O)(=O)C(F)c1cccc(n1)C(F)P(O)(O)=O
: