Target
Pancreatic triacylglycerol lipase
Ligand
BDBM50215413
Substrate
Meas. Tech.
ChEMBL_152476 (CHEMBL856675)
IC50
3440±n/a nM
Citation
 Dollinger, LMHowell, AR A 2-methyleneoxetane analog of orlistat demonstrating inhibition of porcine pancreatic lipase. Bioorg Med Chem Lett 8:977-8 (1998)  
Target
Name:
Pancreatic triacylglycerol lipase
Synonyms:
LIPP_HUMAN PNLIP | Pancreatic lipase
Type:
PROTEIN
Mol. Mass.:
51157.75
Organism:
Homo sapiens (Human)
Description:
ChEMBL_527250
Residue:
465
  
Inhibitor
Name:
BDBM50215413
Synonyms:
CHEMBL360443
Type:
Small organic molecule
Emp. Form.:
C30H55NO4
Mol. Mass.:
493.762
SMILES:
CCCCCCCCCCC[C@@H](C[C@@H]1OC(=C)[C@H]1CCCCCC)OC(=O)[C@H](CC(C)C)NC=O
: