Target
Histamine H3 receptor
Ligand
BDBM50215541
Substrate
Meas. Tech.
ChEBML_83627
Ki
1.0±n/a nM
Citation
 Tozer, MJHarper, EAKalindjian, SBPether, MJShankley, NPWatt, GF From histamine to imidazolylalkyl-sulfonamides: the design of a novel series of histamine H3-receptor antagonists. Bioorg Med Chem Lett 9:1825-30 (1999)  
Target
Name:
Histamine H3 receptor
Synonyms:
HISTAMINE H3 HRH3_CAVPO | Histamine H3 receptor
Type:
Enzyme Catalytic Domain
Mol. Mass.:
48753.61
Organism:
GUINEA PIG
Description:
HISTAMINE H3 HRH3 GUINEA PIG::Q9JI35
Residue:
445
  
Inhibitor
Name:
BDBM50215541
Synonyms:
CHEMBL299589
Type:
Small organic molecule
Emp. Form.:
C16H17N3O2S
Mol. Mass.:
315.39
SMILES:
C[C@H](Cc1c[nH]cn1)NS(=O)(=O)c1ccc2ccccc2c1
: