Target
D(3) dopamine receptor
Ligand
BDBM50216892
Substrate
Meas. Tech.
ChEMBL_58783 (CHEMBL666970)
Ki
0.199526±n/a nM
Citation
 Dubuffet, TNewman-Tancredi, ACussac, DAudinot, VLoutz, AMillan, MJLavielle, G Novel benzopyrano[3,4-c]pyrrole derivatives as potent and selective dopamine D3 receptor antagonist. Bioorg Med Chem Lett 9:2059-64 (1999)  
Target
Name:
D(3) dopamine receptor
Synonyms:
DOPAMINE D3 DRD3_HUMAN Dopamine D3 receptor (D3) Dopamine receptor Dopamine receptor D3
Type:
Mol. Mass.:
44243.43
Organism:
Homo sapiens (Human)
Description:
Residue:
400
  
Inhibitor
Name:
BDBM50216892
Synonyms:
CHEMBL2112210
Type:
Small organic molecule
Emp. Form.:
C29H30N4O2
Mol. Mass.:
466.5741
SMILES:
[H][C@]12CN(CCCCNC(=O)c3ccc(cc3)-c3ccc(N)cc3)C[C@]1([H])c1cc(ccc1OC2)C#N
: