Target
D(3) dopamine receptor
Ligand
BDBM50216871
Substrate
Meas. Tech.
ChEMBL_58783 (CHEMBL666970)
Ki
6.3±n/a nM
Citation
 Dubuffet, TNewman-Tancredi, ACussac, DAudinot, VLoutz, AMillan, MJLavielle, G Novel benzopyrano[3,4-c]pyrrole derivatives as potent and selective dopamine D3 receptor antagonist. Bioorg Med Chem Lett 9:2059-64 (1999)  
Target
Name:
D(3) dopamine receptor
Synonyms:
DOPAMINE D3 DRD3_HUMAN Dopamine D3 receptor (D3) Dopamine receptor Dopamine receptor D3
Type:
Mol. Mass.:
44243.43
Organism:
Homo sapiens (Human)
Description:
Residue:
400
  
Inhibitor
Name:
BDBM50216871
Synonyms:
CHEMBL305392
Type:
Small organic molecule
Emp. Form.:
C20H20N2
Mol. Mass.:
288.3862
SMILES:
N#Cc1ccc2CCC3CN(Cc4ccccc4)CC3c2c1
: