Target
Protein kinase C zeta type
Ligand
BDBM50217037
Substrate
Meas. Tech.
ChEMBL_162387 (CHEMBL767475)
IC50
300000±n/a nM
Citation
 Xu, WCZhou, QAshendel, CLChang, CTChang, CJ Novel protein kinase C inhibitors: synthesis and PKC inhibition of beta-substituted polythiophene derivatives. Bioorg Med Chem Lett 9:2279-82 (1999)  
Target
Name:
Protein kinase C zeta type
Synonyms:
KPCZ_RAT Prkcz Protein kinase C zeta type | nPKC-zeta
Type:
PROTEIN
Mol. Mass.:
67722.31
Organism:
Rattus norvegicus
Description:
ChEMBL_104731
Residue:
592
  
Inhibitor
Name:
BDBM50217037
Synonyms:
CHEMBL72370
Type:
Small organic molecule
Emp. Form.:
C14H12O2S3
Mol. Mass.:
308.439
SMILES:
OCc1csc(c1)-c1ccc(s1)-c1ccc(CO)s1
: