Target
Alpha-2A adrenergic receptor [16-465]/Alpha-2B adrenergic receptor/Alpha-2C adrenergic receptor
Ligand
BDBM50028628
Substrate
Meas. Tech.
ChEMBL_32524 (CHEMBL641405)
Ki
2.90E+4±n/a nM
Citation
 Grunewald, GLCaldwell, TMDahanukar, VHJalluri, RKCriscione, KR Comparative molecular field analysis (CoMFA) models of phenylethanolamine N-methyltransferase (PNMT) and the alpha2-adrenoceptor: the development of new, highly selective inhibitors of PNMT. Bioorg Med Chem Lett 9:481-6 (1999)  
Target
Name:
Alpha-2A adrenergic receptor [16-465]/Alpha-2B adrenergic receptor/Alpha-2C adrenergic receptor
Synonyms:
Adrenergic receptor alpha-2
Type:
Mol. Mass.:
Description:
ASSAY_ID of ChEMBL is 935397
Components:
This complex has 3 components.
Component 1
Name:
Alpha-2C adrenergic receptor
Synonyms:
ADA2C_RAT Adrenergic receptor alpha adrenergic Alpha2 | adrenergic Alpha2C
Type:
Enzyme Catalytic Domain
Mol. Mass.:
49890.50
Organism:
RAT
Description:
adrenergic Alpha2 0 RAT::P22086
Residue:
458
  
Component 2
Name:
Alpha-2B adrenergic receptor
Synonyms:
ADA2B_RAT Adrenergic receptor alpha Alpha-2B adrenergic receptor Alpha-2B adrenoreceptor | adrenergic Alpha2B
Type:
Enzyme Catalytic Domain
Mol. Mass.:
50379.83
Organism:
NEONATAL RAT
Description:
adrenergic Alpha2B ADRA2B NEONATAL RAT::P19328
Residue:
453
  
Component 3
Name:
Alpha-2A adrenergic receptor [16-465]
Synonyms:
ADA2A_RAT Adrenaline 2 Alpha-2A adrenoceptor Alpha-2AAR Alpha2 Adrenoreceptor adrenergic Alpha2A
Type:
G-protein coupled receptor
Mol. Mass.:
48961.69
Organism:
Rattus norvegicus (rat)
Description:
P22909[16-465]
Residue:
450
  
Inhibitor
Name:
BDBM50028628
Synonyms:
(1R)-1-phenylethanamine (alphaR)-alpha-methylbenzenemethanamine D-alpha-methylbenzylamine
Type:
Small organic molecule
Emp. Form.:
C8H11N
Mol. Mass.:
121.1796
SMILES:
C[C@@H](N)c1ccccc1
: