Target
PBP2A
Ligand
BDBM50217405
Substrate
Meas. Tech.
ChEBML_153664
IC50
22±n/a nM
Citation
 Wilkening, RRRatcliffe, RWWildonger, KJCama, LDDykstra, KDDiNinno, FPBlizzard, TAHammond, MLHeck, JVDorso, KLSt Rose, EKohler, JHammond, GG Synthesis and activity of 2-(sulfonamido)methyl-carbapenems: discovery of a novel, anti-MRSA 1,8-naphthosultam pharmacophore. Bioorg Med Chem Lett 9:673-8 (1999)  
Target
Name:
PBP2A
Synonyms:
MecA PBP2' (penicillin binding protein 2') Penicillin-binding protein | mecA
Type:
PROTEIN
Mol. Mass.:
76283.66
Organism:
Staphylococcus aureus
Description:
ChEMBL_105733
Residue:
668
  
Inhibitor
Name:
BDBM50217405
Synonyms:
CHEMBL159153
Type:
Small organic molecule
Emp. Form.:
C22H21N2NaO6S
Mol. Mass.:
464.467
SMILES:
[Na+].[H][C@]1([C@@H](C)O)C(=O)N2C(C([O-])=O)=C(CN3Cc4cccc5cccc(c45)S3(=O)=O)[C@H](C)[C@]12[H]
: