Target
Substance-P receptor
Ligand
BDBM50217507
Substrate
Meas. Tech.
ChEMBL_144914 (CHEMBL749479)
IC50
9.2±n/a nM
Citation
 Nishi, TFukazawa, TIshibashi, KNakajima, KSugioka, YIio, YKurata, HItoh, KMukaiyama, OSatoh, YYamaguchi, T Combined NK1 and NK2 tachykinin receptor antagonists: synthesis and structure-activity relationships of novel oxazolidine analogues. Bioorg Med Chem Lett 9:875-80 (1999)  
Target
Name:
Substance-P receptor
Synonyms:
NK1R_CAVPO Neurokinin NK1 TACR1
Type:
Enzyme Catalytic Domain
Mol. Mass.:
46261.42
Organism:
GUINEA PIG
Description:
Neurokinin NK1 TACR1 GUINEA PIG::P30547
Residue:
407
  
Inhibitor
Name:
BDBM50217507
Synonyms:
CHEMBL171704
Type:
Small organic molecule
Emp. Form.:
C34H37Cl2N3O6
Mol. Mass.:
654.58
SMILES:
COc1cc(cc(OC)c1OC)C(=O)N1CO[C@@](CCN2CCC3(CC2)C(=O)N(C)c2ccccc32)(C1)c1ccc(Cl)c(Cl)c1
: