Target
cAMP-specific 3',5'-cyclic phosphodiesterase 4C
Ligand
BDBM14361
Substrate
Meas. Tech.
ChEMBL_178809 (CHEMBL784398)
IC50
5.0±n/a nM
Citation
 Pascal, YAndrianjara, CRAuclair, EAvenel, NBertin, BCalvet, AFéru, FLardon, SMoodley, IOuagued, MPayne, APruniaux, MPSzilagyi, C Synthesis and structure-activity relationships of 4-oxo-1-phenyl-3,4,6,7-tetrahydro-[1,4]diazepino[6,7,1-hi]indoles: novel PDE4 inhibitors. Bioorg Med Chem Lett 10:35-8 (2000)  
Target
Name:
cAMP-specific 3',5'-cyclic phosphodiesterase 4C
Synonyms:
Dpde1 Pde4c
Type:
PROTEIN
Mol. Mass.:
60038.21
Organism:
Rattus norvegicus
Description:
ChEMBL_104732
Residue:
536
  
Inhibitor
Name:
BDBM14361
Synonyms:
(R,S)-Rolipram 4-[3-(cyclopentyloxy)-4-methoxyphenyl]pyrrolidin-2-one CHEMBL63 | Rolipram
Type:
Small organic molecule
Emp. Form.:
C16H21NO3
Mol. Mass.:
275.3428
SMILES:
COc1ccc(cc1OC1CCCC1)C1CNC(=O)C1
: