Target
D(3) dopamine receptor
Ligand
BDBM50218411
Substrate
Meas. Tech.
ChEMBL_62585 (CHEMBL673113)
Ki
16±n/a nM
Citation
 Austin, NEAvenell, KYBoyfield, IBranch, CLHadley, MSJeffrey, PJohnson, CNMacdonald, GJNash, DJRiley, GJSmith, ABStemp, GThewlis, KMVong, AKWood, M Novel 2,3,4,5-tetrahydro-1H-3-benzazepines with high affinity and selectivity for the dopamine D3 receptor. Bioorg Med Chem Lett 10:2553-5 (2000)  
Target
Name:
D(3) dopamine receptor
Synonyms:
DOPAMINE D3 DRD3_HUMAN Dopamine D3 receptor (D3) Dopamine receptor Dopamine receptor D3
Type:
Mol. Mass.:
44243.43
Organism:
Homo sapiens (Human)
Description:
Residue:
400
  
Inhibitor
Name:
BDBM50218411
Synonyms:
CHEMBL82864
Type:
Small organic molecule
Emp. Form.:
C28H32N4O
Mol. Mass.:
440.5799
SMILES:
O=C(N[C@H]1CC[C@H](CCN2CCc3ccc(cc3CC2)C#N)CC1)c1cc2ccccc2[nH]1
: