Target
Oxytocin receptor
Ligand
BDBM50218619
Substrate
Meas. Tech.
ChEMBL_149053 (CHEMBL857864)
Ki
794±n/a nM
Citation
 Wyatt, PGAllen, MJChilcott, JHickin, GMiller, NDWoollard, PM Structure-activity relationship investigations of a potent and selective benzodiazepine oxytocin antagonist. Bioorg Med Chem Lett 11:1301-5 (2001)  
Target
Name:
Oxytocin receptor
Synonyms:
OT-R OXYR_HUMAN | Oxytocin
Type:
Enzyme Catalytic Domain
Mol. Mass.:
42793.26
Organism:
Homo sapiens (Human)
Description:
Oxytocin OXTR HEK293::B2R9L7
Residue:
389
  
Inhibitor
Name:
BDBM50218619
Synonyms:
CHEMBL422044
Type:
Small organic molecule
Emp. Form.:
C28H25Cl2N5O4
Mol. Mass.:
566.435
SMILES:
CC(=O)NC1N=C(c2ccccc2)c2ccccc2N(CC(=O)N[C@H](Cc2ccc(Cl)c(Cl)c2)C(N)=O)C1=O
: