Target
Oxytocin receptor
Ligand
BDBM50218626
Substrate
Meas. Tech.
ChEMBL_149053 (CHEMBL857864)
Ki
16±n/a nM
Citation
 Wyatt, PGAllen, MJChilcott, JHickin, GMiller, NDWoollard, PM Structure-activity relationship investigations of a potent and selective benzodiazepine oxytocin antagonist. Bioorg Med Chem Lett 11:1301-5 (2001)  
Target
Name:
Oxytocin receptor
Synonyms:
OT-R OXYR_HUMAN | Oxytocin
Type:
Enzyme Catalytic Domain
Mol. Mass.:
42793.26
Organism:
Homo sapiens (Human)
Description:
Oxytocin OXTR HEK293::B2R9L7
Residue:
389
  
Inhibitor
Name:
BDBM50218626
Synonyms:
CHEMBL285312
Type:
Small organic molecule
Emp. Form.:
C35H34N4O4
Mol. Mass.:
574.6689
SMILES:
CC(=O)CCCC(=O)NC1N=C(c2ccccc2)c2ccccc2N(CC(=O)NCCc2ccc3ccccc3c2)C1=O
: