Target
Prostaglandin G/H synthase 1
Ligand
BDBM50218973
Substrate
Meas. Tech.
ChEMBL_159266 (CHEMBL764252)
IC50
13800±n/a nM
Citation
 Shin, SSNoh, MSByun, YJChoi, JKKim, JYLim, KMHa, JYKim, JKLee, CHChung, S 2,2-Dimethyl-4,5-diaryl-3(2H)furanone derivatives as selective cyclo-oxygenase-2 inhibitors. Bioorg Med Chem Lett 11:165-8 (2001)  
Target
Name:
Prostaglandin G/H synthase 1
Synonyms:
Cox-1 Cyclooxygenase-1 PGH1_MOUSE PHS 1 Prostaglandin H2 synthase 1 Ptgs1
Type:
PROTEIN
Mol. Mass.:
69044.61
Organism:
Mus musculus
Description:
ChEMBL_10575
Residue:
602
  
Inhibitor
Name:
BDBM50218973
Synonyms:
CHEMBL44001
Type:
Small organic molecule
Emp. Form.:
C19H17FO4S
Mol. Mass.:
360.399
SMILES:
CC1(C)OC(=C(C1=O)c1cccc(F)c1)c1ccc(cc1)S(C)(=O)=O
: