Target
5-hydroxytryptamine receptor 1A
Ligand
BDBM50219089
Substrate
Meas. Tech.
ChEMBL_1024 (CHEMBL616226)
Ki
251±n/a nM
Citation
 Bromidge, SMGriffith, KHeightman, TDJennings, AKing, FDMoss, SFNewman, HRiley, GRoutledge, CSerafinowska, HTThomas, DR Novel (4-piperazin-1-ylquinolin-6-yl) arylsulfonamides with high affinity and selectivity for the 5-HT(6) receptor. Bioorg Med Chem Lett 11:2843-6 (2001)  
Target
Name:
5-hydroxytryptamine receptor 1A
Synonyms:
5-HT-1A 5-hydroxytryptamine receptor 1A (5-HT-1A) ADRB2RL1 Dopamine D2 receptor and serotonin 1a receptor HTR1A | Serotonin receptor 1A
Type:
Mol. Mass.:
46122.49
Organism:
Homo sapiens (Human)
Description:
Residue:
422
  
Inhibitor
Name:
BDBM50219089
Synonyms:
CHEMBL318018
Type:
Small organic molecule
Emp. Form.:
C22H21ClN4O2S2
Mol. Mass.:
473.011
SMILES:
Cc1sc2ccc(Cl)cc2c1S(=O)(=O)Nc1ccc2nccc(N3CCNCC3)c2c1
: