Target
cAMP-specific 3',5'-cyclic phosphodiesterase 4C
Ligand
BDBM50219177
Substrate
Meas. Tech.
ChEMBL_157223 (CHEMBL769547)
IC50
240±n/a nM
Citation
 Nam, GYoon, CMKim, ERhee, CKKim, JHShin, JHKim, SH Syntheses and evaluation of pyrido[2,3-dlpyrimidine-2,4-diones as PDE 4 inhibitors. Bioorg Med Chem Lett 11:611-4 (2001)  
Target
Name:
cAMP-specific 3',5'-cyclic phosphodiesterase 4C
Synonyms:
Dpde1 Pde4c
Type:
PROTEIN
Mol. Mass.:
60038.21
Organism:
Rattus norvegicus
Description:
ChEMBL_104732
Residue:
536
  
Inhibitor
Name:
BDBM50219177
Synonyms:
CHEMBL347478
Type:
Small organic molecule
Emp. Form.:
C21H16FN3O2
Mol. Mass.:
361.369
SMILES:
Cn1c2nccc(-c3ccccc3F)c2c(=O)n(Cc2ccccc2)c1=O
: