Target
cAMP-specific 3',5'-cyclic phosphodiesterase 4C
Ligand
BDBM50219813
Substrate
Meas. Tech.
ChEMBL_157216 (CHEMBL769540)
IC50
460±n/a nM
Citation
 Buckley, GMCooper, NDyke, HJGalleway, FPGowers, LHaughan, AFKendall, HJLowe, CMaxey, RMontana, JGNaylor, ROxford, JPeake, JCPicken, CLRuncie, KASabin, VSharpe, AWarneck, JB 8-Methoxyquinoline-5-carboxamides as PDE4 inhibitors: a potential treatment for asthma. Bioorg Med Chem Lett 12:1613-5 (2002)  
Target
Name:
cAMP-specific 3',5'-cyclic phosphodiesterase 4C
Synonyms:
Dpde1 Pde4c
Type:
PROTEIN
Mol. Mass.:
60038.21
Organism:
Rattus norvegicus
Description:
ChEMBL_104732
Residue:
536
  
Inhibitor
Name:
BDBM50219813
Synonyms:
CHEMBL296358
Type:
Small organic molecule
Emp. Form.:
C16H11Cl2F3N4O2
Mol. Mass.:
419.185
SMILES:
COc1ccc(C(=O)Nc2c(Cl)cncc2Cl)c2n(C)c(nc12)C(F)(F)F
: