Target
cAMP-specific 3',5'-cyclic phosphodiesterase 4C
Ligand
BDBM50219817
Substrate
Meas. Tech.
ChEMBL_157216 (CHEMBL769540)
IC50
480±n/a nM
Citation
 Buckley, GMCooper, NDyke, HJGalleway, FPGowers, LHaughan, AFKendall, HJLowe, CMaxey, RMontana, JGNaylor, ROxford, JPeake, JCPicken, CLRuncie, KASabin, VSharpe, AWarneck, JB 8-Methoxyquinoline-5-carboxamides as PDE4 inhibitors: a potential treatment for asthma. Bioorg Med Chem Lett 12:1613-5 (2002)  
Target
Name:
cAMP-specific 3',5'-cyclic phosphodiesterase 4C
Synonyms:
Dpde1 Pde4c
Type:
PROTEIN
Mol. Mass.:
60038.21
Organism:
Rattus norvegicus
Description:
ChEMBL_104732
Residue:
536
  
Inhibitor
Name:
BDBM50219817
Synonyms:
CHEMBL43607
Type:
Small organic molecule
Emp. Form.:
C16H12ClN3O2
Mol. Mass.:
313.738
SMILES:
COc1ccc(C(=O)Nc2ccncc2Cl)c2cccnc12
: