Target
Muscarinic acetylcholine receptor M3
Ligand
BDBM50219979
Substrate
Meas. Tech.
ChEMBL_139829 (CHEMBL746304)
Ki
794±n/a nM
Citation
 Gao, LJWaelbroeck, MHofman, SVan Haver, DMilanesio, MViterbo, DDe Clercq, PJ Synthesis and affinity studies of himbacine derived muscarinic receptor antagonists. Bioorg Med Chem Lett 12:1909-12 (2002)  
Target
Name:
Muscarinic acetylcholine receptor M3
Synonyms:
ACM3_HUMAN Cholinergic, muscarinic M3 Muscarinic receptor M3 | RecName: Full=Muscarinic acetylcholine receptor M3
Type:
Enzyme
Mol. Mass.:
66151.03
Organism:
Homo sapiens (Human)
Description:
P20309
Residue:
590
  
Inhibitor
Name:
BDBM50219979
Synonyms:
CHEMBL58824
Type:
Small organic molecule
Emp. Form.:
C22H35NO2
Mol. Mass.:
345.5188
SMILES:
[H][C@]12C[C@@]3([H])CCCC[C@@]3([H])[C@H](\C=C/[C@H]3CCC[C@H](C)N3C)[C@@]1([H])[C@H](C)OC2=O
: