Target
Muscarinic acetylcholine receptor M4
Ligand
BDBM50219978
Substrate
Meas. Tech.
ChEMBL_139830 (CHEMBL746305)
Ki
174±n/a nM
Citation
 Gao, LJWaelbroeck, MHofman, SVan Haver, DMilanesio, MViterbo, DDe Clercq, PJ Synthesis and affinity studies of himbacine derived muscarinic receptor antagonists. Bioorg Med Chem Lett 12:1909-12 (2002)  
Target
Name:
Muscarinic acetylcholine receptor M4
Synonyms:
ACM4_HUMAN Cholinergic, muscarinic M4 Muscarinic acetylcholine receptor M2 and M4
Type:
Enzyme Catalytic Domain
Mol. Mass.:
53079.31
Organism:
Homo sapiens (Human)
Description:
Cholinergic, muscarinic M4 CHRM4 HUMAN M3::P08173
Residue:
479
  
Inhibitor
Name:
BDBM50219978
Synonyms:
CHEMBL301670
Type:
Small organic molecule
Emp. Form.:
C22H35NO2
Mol. Mass.:
345.5188
SMILES:
[H][C@@]12C[C@]3([H])CCCC[C@]3([H])[C@@H](\C=C\[C@H]3CCC[C@H](C)N3C)[C@]1([H])[C@H](C)OC2=O
: