Target
5-hydroxytryptamine receptor 7
Ligand
BDBM50217825
Substrate
Meas. Tech.
ChEMBL_3727 (CHEMBL619899)
Ki
1.8±n/a nM
Citation
 Forbes, ITDouglas, SGribble, ADIfe, RJLightfoot, APGarner, AERiley, GJJeffrey, PStevens, AJStean, TOThomas, DR SB-656104-A: a novel 5-HT(7) receptor antagonist with improved in vivo properties. Bioorg Med Chem Lett 12:3341-4 (2002)  
Target
Name:
5-hydroxytryptamine receptor 7
Synonyms:
5-HT-7 5-HT7 5-HT7S 5HT7 HTR7 | Serotonin receptor 7
Type:
G Protein-Coupled Receptor (GPCR)
Mol. Mass.:
53573.08
Organism:
Homo sapiens (Human)
Description:
P34969
Residue:
479
  
Inhibitor
Name:
BDBM50217825
Synonyms:
CHEMBL323778
Type:
Small organic molecule
Emp. Form.:
C26H30N4O4S
Mol. Mass.:
494.606
SMILES:
O=c1oc2ccccc2n1C1CCN(CC[C@H]2CCCN2S(=O)(=O)c2ccc3cc[nH]c3c2)CC1
: