Target
Isoleucyl-tRNA synthetase
Ligand
BDBM50217842
Substrate
Meas. Tech.
ChEMBL_88825 (CHEMBL698880)
IC50
<1510±n/a nM
Citation
 Shimizu, TUsui, TMachida, KFuruya, KOsada, HNakata, T Chemical modification of reveromycin A and its biological activities. Bioorg Med Chem Lett 12:3363-6 (2002)  
Target
Name:
Isoleucyl-tRNA synthetase
Synonyms:
Type:
PROTEIN
Mol. Mass.:
5742.00
Organism:
Rattus norvegicus
Description:
ChEMBL_88824
Residue:
50
  
Inhibitor
Name:
BDBM50217842
Synonyms:
REVEROMYCIN B
Type:
Small organic molecule
Emp. Form.:
C36H52O11
Mol. Mass.:
660.7915
SMILES:
[H][C@]1(C\C=C(/C)\C=C\[C@H](O)[C@@H](C)\C=C\C(O)=O)O[C@@]2(CC[C@@](CCCC)(O2)[C@@H](OC(=O)CCC(O)=O)\C=C\C(\C)=C\C(O)=O)CC[C@@H]1C
: