Target
cAMP-specific 3',5'-cyclic phosphodiesterase 4C
Ligand
BDBM50219010
Substrate
Meas. Tech.
ChEMBL_157225 (CHEMBL769549)
IC50
270±n/a nM
Citation
 Buckley, GMCooper, NDavenport, RJDyke, HJGalleway, FPGowers, LHaughan, AFKendall, HJLowe, CMontana, JGOxford, JPeake, JCPicken, CLRichard, MDSabin, VSharpe, AWarneck, JB 7-Methoxyfuro[2,3-c]pyridine-4-carboxamides as PDE4 inhibitors: a potential treatment for asthma. Bioorg Med Chem Lett 12:509-12 (2002)  
Target
Name:
cAMP-specific 3',5'-cyclic phosphodiesterase 4C
Synonyms:
Dpde1 Pde4c
Type:
PROTEIN
Mol. Mass.:
60038.21
Organism:
Rattus norvegicus
Description:
ChEMBL_104732
Residue:
536
  
Inhibitor
Name:
BDBM50219010
Synonyms:
CHEMBL151634
Type:
Small organic molecule
Emp. Form.:
C17H14F2N2O3
Mol. Mass.:
332.3015
SMILES:
CCc1cc2c(cnc(OC)c2o1)C(=O)Nc1c(F)cccc1F
: