Target
DNA topoisomerase 2-alpha/2-beta
Ligand
BDBM50221008
Substrate
Meas. Tech.
ChEMBL_75718 (CHEMBL687373)
IC50
>1450000±n/a nM
Citation
 Gray, JLAlmstead, JIGallagher, CPHu, XEKim, NKTaylor, CJTwinem, TLWallace, CDLedoussal, B Synthesis and biological testing of non-fluorinated analogues of levofloxacin. Bioorg Med Chem Lett 13:2373-5 (2003)  
Target
Name:
DNA topoisomerase 2-alpha/2-beta
Synonyms:
DNA topoisomerase II
Type:
Mol. Mass.:
Description:
ASSAY_ID of ChEMBL is 1821483
Components:
This complex has 2 components.
Component 1
Name:
DNA topoisomerase 2-alpha
Synonyms:
DNA topoisomerase 2-alpha DNA topoisomerase II (Topo II) DNA topoisomerase II, alpha isozyme TOP2A Topoisomerase I/II | Topoisomerase II alpha (HuTopoIIα)
Type:
Protein
Mol. Mass.:
174415.30
Organism:
Homo sapiens (Human)
Description:
P11388
Residue:
1531
  
Component 2
Name:
DNA topoisomerase 2-beta
Synonyms:
DNA topoisomerase II TOP2B | TOP2B_HUMAN
Type:
PROTEIN
Mol. Mass.:
183284.13
Organism:
Homo sapiens (Human)
Description:
ChEMBL_51583
Residue:
1626
  
Inhibitor
Name:
BDBM50221008
Synonyms:
CHEMBL80587
Type:
Small organic molecule
Emp. Form.:
C18H21N3O4
Mol. Mass.:
343.377
SMILES:
C[C@H]1COc2c(ccc3c2n1cc(C(O)=O)c3=O)N1CCC[C@H](N)C1
: